Reaction Details
Target5-hydroxytryptamine receptor 4
LigandBDBM81781
Substrate/Competitorn/a
Ki 263±n/a nM
CommentsPDSP_155
Citation Adham, NGerald, CSchechter, LVaysse, PWeinshank, RBranchek, T [3H]5-hydroxytryptamine labels the agonist high affinity state of the cloned rat 5-HT4 receptor. Eur J Pharmacol304:231-5 (1996) 
 
5-hydroxytryptamine receptor 4
Name:5-hydroxytryptamine receptor 4
Type:Enzyme Catalytic Domain
Mol. Mass.:46117.31
Organism:RAT
Description:5-HT4 HTR4 RAT::Q62758
Residue:406
BDBM81781
NameBDBM81781
Synonyms:5-HT,a-Me | 5-HT,omega-N-Me
Typen/a
Emp. Form.C11H14N2O
Mol. Mass.190.2417
SMILESCn1cc(CCN)c2cc(O)ccc12