Reaction Details
Target5-hydroxytryptamine 1D receptor
LigandBDBM84994
Substrate/Competitorn/a
Ki 18±n/a nM
CommentsPDSP_1422
Citation Bymaster, FPCalligaro, DOFalcone, JFMarsh, RDMoore, NATye, NCSeeman, PWong, DT Radioreceptor binding profile of the atypical antipsychotic olanzapine. Neuropsychopharmacology14:87-96 (1996) 
 
5-hydroxytryptamine 1D receptor
Name:5-hydroxytryptamine 1D receptor
Type:Protein
Mol. Mass.:12731.52
Organism:Bos taurus (Bovine)
Description:Q8MI13
Residue:119
BDBM84994
NameBDBM84994
Synonyms:CAS_163091 ORG-5222
TypeSmall organic molecule
Emp. Form.C17H16ClNO
Mol. Mass.285.768
SMILESCN1CC2C(C1)c1cc(Cl)ccc1Oc1ccccc21