Reaction Details
TargetMuscarinic acetylcholine receptor M1
LigandBDBM22869
Substrate/Competitorn/a
Ki 1.4±n/a nM
CommentsPDSP_552
Citation Bymaster, FPCalligaro, DOFalcone, JFMarsh, RDMoore, NATye, NCSeeman, PWong, DT Radioreceptor binding profile of the atypical antipsychotic olanzapine. Neuropsychopharmacology14:87-96 (1996) 
 
Muscarinic acetylcholine receptor M1
Name:Muscarinic acetylcholine receptor M1
Type:Protein
Mol. Mass.:51442.54
Organism:Homo sapiens (Human)
Description:P11229
Residue:460
BDBM22869
NameBDBM22869
Synonyms:6-chloro-10-(4-methylpiperazin-1-yl)-2,9-diazatricyclo[9.4.0.0^{3,8}]pentadeca-1,3(8),4,6,10,12,14-heptaene Clozapine US10259786, Clozapine
TypeSmall organic molecule
Emp. Form.C18H19ClN4
Mol. Mass.326.823
SMILESCN1CCN(CC1)C1=c2ccccc2=Nc2ccc(Cl)cc2N1