Reaction Details
TargetNeuropeptide Y receptor type 5
LigandBDBM82282
Substrate/Competitorn/a
Ki 56±n/a nM
CommentsPDSP_1382
Citation Hu, YBloomquist, BTCornfield, LJDeCarr, LBFlores-Riveros, JRFriedman, LJiang, PLewis-Higgins, LSadlowski, YSchaefer, JVelazquez, NMcCaleb, ML Identification of a novel hypothalamic neuropeptide Y receptor associated with feeding behavior. J Biol Chem271:26315-9 (1996) 
 
Neuropeptide Y receptor type 5
Name:Neuropeptide Y receptor type 5
Type:Enzyme
Mol. Mass.:50746.64
Organism:Homo sapiens (Human)
Description:Q15761
Residue:445
BDBM82282
NameBDBM82282
Synonyms:NPY13-36 | NPY13-36, porcine
TypeSmall organic molecule
Emp. Form.C135H209N41O36
Mol. Mass.2982.3571
SMILESCC[C@H](C)[C@H](NC(=O)[C@H](Cc1ccc(O)cc1)NC(=O)[C@H](Cc1cnc[nH]1)NC(=O)[C@H](CCCN=C(N)N)NC(=O)[C@H](CC(C)C)NC(=O)[C@H](C)NC(=O)[C@H](CO)NC(=O)[C@H](Cc1ccc(O)cc1)NC(=O)[C@H](Cc1ccc(O)cc1)NC(=O)[C@H](CCCN=C(N)N)NC(=O)[C@H](C)NC(=O)[C@H](CC(C)C)NC(=O)[C@H](CC(O)=O)NC(=O)[C@H](CCC(O)=O)NC(=O)[C@H](C)NC(=O)[C@@H]1CCCN1)C(=O)N[C@@H](CC(N)=O)C(=O)N[C@@H](CC(C)C)C(=O)N[C@@H]([C@@H](C)CC)C(=O)N[C@@H]([C@@H](C)O)C(=O)N[C@@H](CCCN=C(N)N)C(=O)N[C@@H](CCC(N)=O)C(=O)N[C@@H](CCCN=C(N)N)C(=O)N[C@@H](Cc1ccc(O)cc1)C(N)=O