Reaction Details
TargetMetabotropic glutamate receptor 2
LigandBDBM50062500
Substrate/Competitorn/a
Ki>10000±n/a nM
CommentsPDSP_3728
Citation Gomeza, JMary, SBrabet, IParmentier, MLRestituito, SBockaert, JPin, JP Coupling of metabotropic glutamate receptors 2 and 4 to G alpha 15, G alpha 16, and chimeric G alpha q/i proteins: characterization of new antagonists. Mol Pharmacol50:923-30 (1996) Metabotropic glutamate receptor 2
Name:Metabotropic glutamate receptor 2
Type:Enzyme
Mol. Mass.:95584.88
Organism:Homo sapiens (Human)
Description:Q14416
Residue:872
BDBM50062500
NameBDBM50062500
Synonyms:(S)-2-((R)-1-Amino-1-carboxy-ethyl)-cyclopropanecarboxylic acid MCCG | MCCG-I
TypeSmall organic molecule
Emp. Form.C7H11NO4
Mol. Mass.173.1665
SMILESC[C@@](N)(C1C[C@@H]1C(O)=O)C(O)=O