Reaction Details
TargetMelanocortin receptor 3
LigandBDBM82416
Substrate/Competitorn/a
Ki 10.9±n/a nM
CommentsPDSP_2959
Citation Schiöth, HBMuceniece, RWikberg, JE Characterisation of the melanocortin 4 receptor by radioligand binding. Pharmacol Toxicol79:161-5 (1996) 
 
Melanocortin receptor 3
Name:Melanocortin receptor 3
Type:Enzyme
Mol. Mass.:36044.86
Organism:Homo sapiens (Human)
Description:P41968
Residue:323
BDBM82416
NameBDBM82416
Synonyms:Gamma3-MSH
TypeSmall organic molecule
Emp. Form.C126H188N44O37S
Mol. Mass.2943.179
SMILESCSCC[C@H](NC(=O)[C@@H](NC(=O)[C@@H](N)Cc1ccc(O)cc1)C(C)C)C(=O)NCC(=O)N[C@@H](Cc1cnc[nH]1)C(=O)N[C@@H](Cc1ccccc1)C(=O)N[C@@H](CCCN=C(N)N)C(=O)N[C@@H](Cc1c[nH]c2ccccc12)C(=O)N[C@@H](CC(O)=O)C(=O)N[C@@H](CCCN=C(N)N)C(=O)N[C@@H](Cc1ccccc1)C(=O)NCC(=O)N[C@H](CCCN=C(N)N)C(=O)N[C@H](CCCN=C(N)N)C(=O)N[C@H](CC(N)=O)C(=O)NCC(=O)N[C@H](CO)C(=O)N[C@H](CO)C(=O)N[C@H](CO)C(=O)N[C@H](CO)C(=O)NCC(=O)N[C@H](C(C)C)C(=O)NCC(=O)NCC(=O)N[C@H](C)C(=O)N[C@H](C)C(=O)N[C@H](CCC(N)=O)C(O)=O