Reaction Details
Target5-hydroxytryptamine receptor 2A
LigandBDBM50048803
Substrate/Competitorn/a
Ki 0.31±n/a nM
CommentsPDSP_1996
Citation Schotte, AJanssen, PFGommeren, WLuyten, WHVan Gompel, PLesage, ASDe Loore, KLeysen, JE Risperidone compared with new and reference antipsychotic drugs: in vitro and in vivo receptor binding. Psychopharmacology (Berl)124:57-73 (1996) 
 
5-hydroxytryptamine receptor 2A
Name:5-hydroxytryptamine receptor 2A
Type:G Protein-Coupled Receptor (GPCR)
Mol. Mass.:52852.05
Organism:Rattus norvegicus (rat)
Description:Rat cortex membranes 5-HT2A receptors.
Residue:471
BDBM50048803
NameBDBM50048803
Synonyms:5-(2-(4-(benzo[d]isothiazol-3-yl)piperazin-1-yl)ethyl)-6-chloroindolin-2-one 5-[2-(4-Benzo[d]isothiazol-3-yl-piperazin-1-yl)-ethyl]-6-chloro-1,3-dihydro-indol-2-one (Ziprasidone) CHEMBL708 ZIPRASIDONE | ZIPRASIDONE HYDROCHLORIDE
TypeSmall organic molecule
Emp. Form.C21H21ClN4OS
Mol. Mass.412.936
SMILESClc1cc2NC(=O)Cc2cc1CCN1CCN(CC1)c1nsc2ccccc12