Reaction Details
TargetAlpha-2C adrenergic receptor
LigandBDBM50252513
Substrate/Competitorn/a
Ki 11±n/a nM
CommentsPDSP_1600
Citation Schotte, AJanssen, PFGommeren, WLuyten, WHVan Gompel, PLesage, ASDe Loore, KLeysen, JE Risperidone compared with new and reference antipsychotic drugs: in vitro and in vivo receptor binding. Psychopharmacology (Berl)124:57-73 (1996) 
 
Alpha-2C adrenergic receptor
Name:Alpha-2C adrenergic receptor
Type:Enzyme
Mol. Mass.:49552.32
Organism:Homo sapiens (Human)
Description:P18825
Residue:462
BDBM50252513
NameBDBM50252513
Synonyms:3-(2-(4-(6-fluorobenzo[d]isoxazol-3-yl)piperidin-1-yl)ethyl)-9-hydroxy-2-methyl-6,7,8,9-tetrahydropyrido[1,2-a]pyrimidin-4-one 9-hydroxy risperidone Invega | PALIPERIDONE
TypeSmall organic molecule
Emp. Form.C23H27FN4O3
Mol. Mass.426.4839
SMILESCc1nc2C(O)CCCn2c(=O)c1CCN1CCC(CC1)c1noc2cc(F)ccc12