Reaction Details
TargetBeta-2 adrenergic receptor
LigandBDBM25761
Substrate/Competitorn/a
Ki 0.01±n/a nM
CommentsPDSP_1538
Citation Schotte, AJanssen, PFGommeren, WLuyten, WHVan Gompel, PLesage, ASDe Loore, KLeysen, JE Risperidone compared with new and reference antipsychotic drugs: in vitro and in vivo receptor binding. Psychopharmacology (Berl)124:57-73 (1996) 
 
Beta-2 adrenergic receptor
Name:Beta-2 adrenergic receptor
Type:n/a
Mol. Mass.:46461.69
Organism:Homo sapiens (Human)
Description:P07550
Residue:413
BDBM25761
NameBDBM25761
Synonyms:Anapriline CHEMBL27 PROPRANOLOL, d PROPRANOLOL,(+) Propanolol Propranolol | [2-hydroxy-3-(naphthalen-1-yloxy)propyl](propan-2-yl)amine
TypeSmall organic molecule
Emp. Form.C16H21NO2
Mol. Mass.259.3434
SMILESCC(C)NCC(O)COc1cccc2ccccc12