Reaction Details
TargetVoltage-dependent L-type calcium channel subunit alpha-1C
LigandBDBM81483
Substrate/Competitorn/a
Ki 5000±n/a nM
CommentsPDSP_1499
Citation Schotte, AJanssen, PFGommeren, WLuyten, WHVan Gompel, PLesage, ASDe Loore, KLeysen, JE Risperidone compared with new and reference antipsychotic drugs: in vitro and in vivo receptor binding. Psychopharmacology (Berl)124:57-73 (1996) 
 
Voltage-dependent L-type calcium channel subunit alpha-1C
Name:Voltage-dependent L-type calcium channel subunit alpha-1C
Type:Enzyme Catalytic Domain
Mol. Mass.:243492.26
Organism:RAT
Description:Calcium channel 0 RAT::P22002
Residue:2169
BDBM81483
NameBDBM81483
Synonyms:CAS_1893-33-0 PIPAMPERONE
TypeSmall organic molecule
Emp. Form.C21H30FN3O2
Mol. Mass.375.4802
SMILESNC(=O)C1(CCN(CCCC(=O)c2ccc(F)cc2)CC1)N1CCCCC1