Reaction Details
TargetCholecystokinin
LigandBDBM82479
Substrate/Competitorn/a
Ki 1000±n/a nM
CommentsPDSP_1408
Citation Schotte, AJanssen, PFGommeren, WLuyten, WHVan Gompel, PLesage, ASDe Loore, KLeysen, JE Risperidone compared with new and reference antipsychotic drugs: in vitro and in vivo receptor binding. Psychopharmacology (Berl)124:57-73 (1996) 
 
Cholecystokinin
Name:Cholecystokinin
Type:Enzyme Catalytic Domain
Mol. Mass.:12528.64
Organism:GUINEA PIG
Description:Cholecystokinin B 0 GUINEA PIG::P01356
Residue:114
BDBM82479
NameBDBM82479
Synonyms:CAS_132539-06-1 OLANZAPINE | USRE49340, Rank 2
TypeSmall organic molecule
Emp. Form.C17H20N4S
Mol. Mass.312.432
SMILESCN1CCN(CC1)C1=c2cc(C)sc2=Nc2ccccc2N1