Reaction Details
TargetD(2) dopamine receptor
LigandBDBM82479
Substrate/Competitorn/a
Ki 17±n/a nM
CommentsPDSP_1408
Citation Schotte, AJanssen, PFGommeren, WLuyten, WHVan Gompel, PLesage, ASDe Loore, KLeysen, JE Risperidone compared with new and reference antipsychotic drugs: in vitro and in vivo receptor binding. Psychopharmacology (Berl)124:57-73 (1996) 
 
D(2) dopamine receptor
Name:D(2) dopamine receptor
Type:G Protein-Coupled Receptor (GPCR)
Mol. Mass.:50931.60
Organism:Rattus norvegicus (rat)
Description:P61169
Residue:444
BDBM82479
NameBDBM82479
Synonyms:CAS_132539-06-1 OLANZAPINE | USRE49340, Rank 2
TypeSmall organic molecule
Emp. Form.C17H20N4S
Mol. Mass.312.432
SMILESCN1CCN(CC1)C1=c2cc(C)sc2=Nc2ccccc2N1