Reaction Details
TargetDelta-type opioid receptor
LigandBDBM35255
Substrate/Competitorn/a
Ki 1000±n/a nM
CommentsPDSP_2002
Citation Schotte, AJanssen, PFGommeren, WLuyten, WHVan Gompel, PLesage, ASDe Loore, KLeysen, JE Risperidone compared with new and reference antipsychotic drugs: in vitro and in vivo receptor binding. Psychopharmacology (Berl)124:57-73 (1996) 
 
Delta-type opioid receptor
Name:Delta-type opioid receptor
Type:Enzyme Catalytic Domain
Mol. Mass.:40577.25
Organism:MOUSE
Description:P32300
Residue:372
BDBM35255
NameBDBM35255
Synonyms:2-Chlor-11-(2-dimethylaminoaethoxy)-dibenzo(b,f)-thiepin 2-[(8-chlorodibenzo[b,f]thiepin-10-yl)oxy]-N,N-dimethylethanamine Nipolept zotepine
TypeSmall organic molecule
Emp. Form.C18H18ClNOS
Mol. Mass.331.86
SMILESCN(C)CCOC1=Cc2ccccc2Sc2ccc(Cl)cc12