Reaction Details
TargetKappa-type opioid receptor
LigandBDBM83436
Substrate/Competitorn/a
Ki 1.53±n/a nM
CommentsPDSP_1741
Citation Schotte, AJanssen, PFGommeren, WLuyten, WHVan Gompel, PLesage, ASDe Loore, KLeysen, JE Risperidone compared with new and reference antipsychotic drugs: in vitro and in vivo receptor binding. Psychopharmacology (Berl)124:57-73 (1996) 
 
Kappa-type opioid receptor
Name:Kappa-type opioid receptor
Type:G Protein-Coupled Receptor (GPCR)
Mol. Mass.:42744.99
Organism:Cavia porcellus (domestic guinea pig)
Description:P41144
Residue:380
BDBM83436
NameBDBM83436
Synonyms:2-(3,4-dichlorophenyl)-N-methyl-N-[(5R,7S,8S)-7-(1-pyrrolidinyl)-1-oxaspiro[4.5]decan-8-yl]acetamide;methanesulfonic acid 2-(3,4-dichlorophenyl)-N-methyl-N-[(5R,7S,8S)-7-pyrrolidin-1-yl-1-oxaspiro[4.5]decan-8-yl]ethanamide;methanesulfonic acid MLS002153429 Spiradoline cid_55651
TypeSmall organic molecule
Emp. Form.C22H30Cl2N2O2
Mol. Mass.425.392
SMILESCN([C@H]1CC[C@@]2(CCCO2)C[C@@H]1N1CCCC1)C(=O)Cc1ccc(Cl)c(Cl)c1