Reaction Details
TargetBeta-arrestin-1
LigandBDBM85035
Substrate/Competitorn/a
Ki 0.55±n/a nM
CommentsPDSP_1436
Citation Schotte, AJanssen, PFGommeren, WLuyten, WHVan Gompel, PLesage, ASDe Loore, KLeysen, JE Risperidone compared with new and reference antipsychotic drugs: in vitro and in vivo receptor binding. Psychopharmacology (Berl)124:57-73 (1996) 
 
Beta-arrestin-1
Name:Beta-arrestin-1
Type:Enzyme Catalytic Domain
Mol. Mass.:46360.54
Organism:RABBIT
Description:Cholinergic, muscarinic 0 RABBIT::Q95223
Residue:410
BDBM85035
NameBDBM85035
Synonyms:CAS_65154-06-5 bloodplatelet-activatingfactor
TypeSmall organic molecule
Emp. Form.C26H54NO7P
Mol. Mass.523.6832
[C@H](COP([O-])(=O)OCC[N+](C)(C)C)OC(C)=O