Reaction Details
Target5-hydroxytryptamine receptor 4
LigandBDBM10755
Substrate/Competitorn/a
Ki 79.43±n/a nM
CommentsPDSP_150
Citation Claeysen, SSebben, MJournot, LBockaert, JDumuis, A Cloning, expression and pharmacology of the mouse 5-HT(4L) receptor. FEBS Lett398:19-25 (1996) 
 
5-hydroxytryptamine receptor 4
Name:5-hydroxytryptamine receptor 4
Type:Enzyme Catalytic Domain
Mol. Mass.:43970.99
Organism:MOUSE
Description:5-HT4 HTR4 MOUSE::P97288
Residue:388
BDBM10755
NameBDBM10755
Synonyms:14C-5-hydroxy tryptamine creatinine disulfate 5-HT 5-hydroxy tryptamine creatinine disulfate Serotonin | [3H]-5-HT
TypeSmall organic molecule
Emp. Form.C10H12N2O
Mol. Mass.176.2151
SMILESNCCc1c[nH]c2ccc(O)cc12