Reaction Details
TargetAdenosine receptor A3
LigandBDBM85037
Substrate/Competitorn/a
Ki 169±n/a nM
CommentsPDSP_220
Citation Hill, RJOleynek, JJHoth, CFKiron, MAWeng, WWester, RTTracey, WRKnight, DRBuchholz, RAKennedy, SP Cloning, expression and pharmacological characterization of rabbit adenosine A1 and A3 receptors. J Pharmacol Exp Ther280:122-8 (1997) Adenosine receptor A3
Name:Adenosine receptor A3
Type:Protein
Mol. Mass.:36319.35
Organism:Oryctolagus cuniculus (rabbit)
Description:O02667
Residue:319
BDBM85037
NameBDBM85037
Synonyms:ABA | CAS_14375-45-2
TypeSmall organic molecule
Emp. Form.C15H20O4
Mol. Mass.264.3169
SMILESCC(C=C[C@@]1(O)C(C)=CC(=O)CC1(C)C)=CC(O)=O