Reaction Details
TargetAdenosine receptor A3
LigandBDBM85036
Substrate/Competitorn/a
Ki 746±n/a nM
CommentsPDSP_458
Citation Hill, RJOleynek, JJHoth, CFKiron, MAWeng, WWester, RTTracey, WRKnight, DRBuchholz, RAKennedy, SP Cloning, expression and pharmacological characterization of rabbit adenosine A1 and A3 receptors. J Pharmacol Exp Ther280:122-8 (1997) Adenosine receptor A3
Name:Adenosine receptor A3
Type:Protein
Mol. Mass.:36319.35
Organism:Oryctolagus cuniculus (rabbit)
Description:O02667
Residue:319
BDBM85036
NameBDBM85036
Synonyms:BW-A1433 CAS_129447 | NSC_129447
TypeSmall organic molecule
Emp. Form.C20H22N4O4
Mol. Mass.382.4131
SMILESCCCn1c2nc([nH]c2c(=O)n(CCC)c1=O)-c1ccc(C=CC(O)=O)cc1