Reaction Details
TargetGamma-aminobutyric acid receptor subunit alpha-4
LigandBDBM84956
Substrate/Competitorn/a
Ki 6.8±n/a nM
CommentsPDSP_503
Citation Gunnersen, DKaufman, CMSkolnick, P Pharmacological properties of recombinant "diazepam-insensitive" GABAA receptors. Neuropharmacology35:1307-14 (1996) 
 
Gamma-aminobutyric acid receptor subunit alpha-4
Name:Gamma-aminobutyric acid receptor subunit alpha-4
Type:Enzyme
Mol. Mass.:60972.37
Organism:Rattus norvegicus (Rat)
Description:P28471
Residue:552
BDBM84956
NameBDBM84956
Synonyms:2-(4-Methoxy-phenyl)-2,5-dihydro-pyrazolo[4,3-c]quinolin-3-one (CGS 9895) CHEMBL296335
TypeSmall organic molecule
Emp. Form.C17H13N3O2
Mol. Mass.291.304
SMILESCOc1ccc(cc1)-n1[nH]c2c(cnc3ccccc23)c1=O