Reaction Details
TargetGamma-aminobutyric acid receptor subunit alpha-6
LigandBDBM50017009
Substrate/Competitorn/a
Ki 34.3±n/a nM
CommentsPDSP_502
Citation Gunnersen, DKaufman, CMSkolnick, P Pharmacological properties of recombinant "diazepam-insensitive" GABAA receptors. Neuropharmacology35:1307-14 (1996) 
 
Gamma-aminobutyric acid receptor subunit alpha-6
Name:Gamma-aminobutyric acid receptor subunit alpha-6
Type:Enzyme Catalytic Domain
Mol. Mass.:51188.24
Organism:RAT
Description:GABA A Alpha6Beta2Gamma2 0 RAT::P30191
Residue:453
BDBM50017009
NameBDBM50017009
Synonyms:2-Phenyl-2,3a-dihydro-pyrazolo[4,3-c]quinolin-3-one(CGS 8216) 2-Phenyl-2,5-dihydro-pyrazolo[4,3-c]quinolin-3-one (CGS 8216) 2-Phenyl-2,5-dihydro-pyrazolo[4,3-c]quinolin-3-one(CGS-8216) CGS 8216, 1 CHEMBL19732
TypeSmall organic molecule
Emp. Form.C16H11N3O
Mol. Mass.261.278
SMILESO=c1n([nH]c2c1cnc1ccccc21)-c1ccccc1