Reaction Details
TargetD(2) dopamine receptor
LigandBDBM84342
Substrate/Competitorn/a
Ki 427±n/a nM
CommentsPDSP_238
Citation Seeman, PGuan, HCNobrega, JJiwa, DMarkstein, RBalk, JHPicetti, RBorrelli, EVan Tol, HH Dopamine D2-like sites in schizophrenia, but not in Alzheimer's, Huntington's, or control brains, for [3H]benzquinoline. Synapse25:137-46 (1997) 
 
D(2) dopamine receptor
Name:D(2) dopamine receptor
Type:G Protein-Coupled Receptor (GPCR)
Mol. Mass.:50931.60
Organism:Rattus norvegicus (rat)
Description:P61169
Residue:444
BDBM84342
NameBDBM84342
Synonyms:4-[1-hydroxy-2-(methylamino)ethyl]benzene-1,2-diol 4-[1-hydroxy-2-(methylamino)ethyl]benzene-1,2-diol;hydrochloride 4-[2-(methylamino)-1-oxidanyl-ethyl]benzene-1,2-diol;hydrochloride EPINEPHRINE MLS001333244 cid_5924
TypeSmall organic molecule
Emp. Form.C9H13NO3
Mol. Mass.183.2044
SMILESCNCC(O)c1ccc(O)c(O)c1