Reaction Details
TargetD(1A) dopamine receptor
LigandBDBM67544
Substrate/Competitorn/a
Ki 530±n/a nM
CommentsPDSP_1909
Citation Creese, IBurt, DRSnyder, SH Dopamine receptor binding predicts clinical and pharmacological potencies of antischizophrenic drugs. J Neuropsychiatry Clin Neurosci8:223-6 (1996) 
 
D(1A) dopamine receptor
Name:D(1A) dopamine receptor
Type:Enzyme Catalytic Domain
Mol. Mass.:49330.65
Organism:BOVINE
Description:DOPAMINE D1 DRD1 BOVINE::Q95136
Residue:446
BDBM67544
NameBDBM67544
Synonyms:N,N-dimethyl-3-[2-(trifluoromethyl)-10-phenothiazinyl]-1-propanamine;hydrochloride SR-01000000224-4 cid_66069 med.21724, Compound Triflupromazine
TypeSmall organic molecule
Emp. Form.C18H19F3N2S
Mol. Mass.352.417
SMILESCN(C)CCCN1c2ccccc2Sc2ccc(cc12)C(F)(F)F