Reaction Details
TargetD(2) dopamine receptor
LigandBDBM81483
Substrate/Competitorn/a
Ki 31.3±n/a nM
CommentsPDSP_1499
Citation Creese, IBurt, DRSnyder, SH Dopamine receptor binding predicts clinical and pharmacological potencies of antischizophrenic drugs. J Neuropsychiatry Clin Neurosci8:223-6 (1996) 
 
D(2) dopamine receptor
Name:D(2) dopamine receptor
Type:Enzyme Catalytic Domain
Mol. Mass.:50698.79
Organism:BOVINE
Description:P20288
Residue:444
BDBM81483
NameBDBM81483
Synonyms:CAS_1893-33-0 PIPAMPERONE
TypeSmall organic molecule
Emp. Form.C21H30FN3O2
Mol. Mass.375.4802
SMILESNC(=O)C1(CCN(CCCC(=O)c2ccc(F)cc2)CC1)N1CCCCC1