Reaction Details
TargetMelatonin receptor type 1A
LigandBDBM50260394
Substrate/Competitorn/a
Ki 2716±n/a nM
CommentsPDSP_170
Citation Dubocovich, MLMasana, MIIacob, SSauri, DM Melatonin receptor antagonists that differentiate between the human Mel1a and Mel1b recombinant subtypes are used to assess the pharmacological profile of the rabbit retina ML1 presynaptic heteroreceptor. Naunyn Schmiedebergs Arch Pharmacol355:365-75 (1997) 
 
Melatonin receptor type 1A
Name:Melatonin receptor type 1A
Type:Enzyme
Mol. Mass.:39392.94
Organism:Homo sapiens (Human)
Description:P48039
Residue:350
BDBM50260394
NameBDBM50260394
Synonyms:5-MCA-NAT CHEMBL504585 | methyl 3-(2-acetamidoethyl)-1H-indol-5-ylcarbamate
TypeSmall organic molecule
Emp. Form.C14H17N3O3
Mol. Mass.275.3031
SMILESCOC(=O)Nc1ccc2[nH]cc(CCNC(C)=O)c2c1