Reaction Details
Target5-hydroxytryptamine receptor 2A
LigandBDBM85067
Substrate/Competitorn/a
Ki 5.8±n/a nM
CommentsPDSP_1509
Citation Tang, AHFranklin, SRHimes, CSSmith, MWTenbrink, RE PNU-96415E, a potential antipsychotic agent with clozapine-like pharmacological properties. J Pharmacol Exp Ther281:440-7 (1997) 5-hydroxytryptamine receptor 2A
Name:5-hydroxytryptamine receptor 2A
Type:G Protein-Coupled Receptor (GPCR)
Mol. Mass.:52852.05
Organism:Rattus norvegicus (rat)
Description:Rat cortex membranes 5-HT2A receptors.
Residue:471
BDBM85067
NameBDBM85067
Synonyms:CAS_170856-41-4 PNU 96415E | PNU-96415E
TypeSmall organic molecule
Emp. Form.C21H25FN2O
Mol. Mass.340.4344
SMILESFc1ccc(cc1)N1CCN(CCC2OCCc3ccccc23)CC1