Reaction Details
TargetGalanin receptor type 2
LigandBDBM85068
Substrate/Competitorn/a
Ki 23±n/a nM
CommentsPDSP_2431
Citation Howard, ADTan, CShiao, LLPalyha, OCMcKee, KKWeinberg, DHFeighner, SDCascieri, MASmith, RGVan Der Ploeg, LHSullivan, KA Molecular cloning and characterization of a new receptor for galanin. FEBS Lett405:285-90 (1997) 
 
Galanin receptor type 2
Name:Galanin receptor type 2
Type:Enzyme Catalytic Domain
Mol. Mass.:40697.04
Organism:RAT
Description:Galanin R2 GALR2 RAT::O08726
Residue:372
BDBM85068
NameBDBM85068
Synonyms:Gal(1-13)-Std I
TypeSmall organic molecule
Emp. Form.C138H199N35O30
Mol. Mass.2828.2732
SMILESCC(C)C[C@H](NC(=O)[C@H](CC(C)C)NC(=O)[C@H](Cc1ccc(O)cc1)NC(=O)CNC(=O)[C@H](C)NC(=O)[C@H](CO)NC(=O)[C@H](CC(N)=O)NC(=O)[C@H](CC(C)C)NC(=O)[C@@H](NC(=O)[C@H](Cc1c[nH]c2ccccc12)NC(=O)CN)[C@@H](C)O)C(=O)NCC(=O)N1CCC[C@H]1C(=O)N[C@H](CCCN=C(N)N)C(=O)N1CCC[C@H]1C(=O)N[C@@H](CCCCN)C(=O)N1CCC[C@H]1C(=O)N[C@@H](CCC(N)=O)C(=O)N[C@@H](CCC(N)=O)C(=O)N[C@H](Cc1c[nH]c2ccccc12)C(=O)NC(=O)[C@H](CC(C)C)NC(=O)[C@H](CC(C)C)NC(=O)[C@@H](Cc1c[nH]c2ccccc12)NC(=O)[C@@H](N)Cc1ccccc1