Reaction Details
TargetGalanin receptor type 2
LigandBDBM85073
Substrate/Competitorn/a
Ki 28±n/a nM
CommentsPDSP_3166
Citation Howard, ADTan, CShiao, LLPalyha, OCMcKee, KKWeinberg, DHFeighner, SDCascieri, MASmith, RGVan Der Ploeg, LHSullivan, KA Molecular cloning and characterization of a new receptor for galanin. FEBS Lett405:285-90 (1997) 
 
Galanin receptor type 2
Name:Galanin receptor type 2
Type:Enzyme Catalytic Domain
Mol. Mass.:40697.04
Organism:RAT
Description:Galanin R2 GALR2 RAT::O08726
Residue:372
BDBM85073
NameBDBM85073
Synonyms:CAS_3043476 NSC_3043476
TypeSmall organic molecule
Emp. Form.C23H30N2O3
Mol. Mass.382.4959
SMILESCOc1ccccc1N(CCOc1ccc(C)cc1)C(=O)CN1CCCCC1