Reaction Details
TargetGalanin receptor type 2
LigandBDBM50273370
Substrate/Competitorn/a
Ki 0.43±n/a nM
CommentsPDSP_3167
Citation Howard, ADTan, CShiao, LLPalyha, OCMcKee, KKWeinberg, DHFeighner, SDCascieri, MASmith, RGVan Der Ploeg, LHSullivan, KA Molecular cloning and characterization of a new receptor for galanin. FEBS Lett405:285-90 (1997) 
 
Galanin receptor type 2
Name:Galanin receptor type 2
Type:Enzyme Catalytic Domain
Mol. Mass.:40697.04
Organism:RAT
Description:Galanin R2 GALR2 RAT::O08726
Residue:372
BDBM50273370
NameBDBM50273370
Synonyms:CHEMBL503473 Galanin (1-13)-bradikinin(2-9) M35
TypeSmall organic molecule
Emp. Form.C107H153N27O26
Mol. Mass.2233.525
SMILESCC(C)C[C@H](NC(=O)[C@H](CC(C)C)NC(=O)[C@H](Cc1ccc(O)cc1)NC(=O)CNC(=O)[C@H](C)NC(=O)[C@H](CO)NC(=O)[C@H](CC(N)=O)NC(=O)[C@H](CC(C)C)NC(=O)[C@@H](NC(=O)[C@H](Cc1c[nH]c2ccccc12)NC(=O)CN)[C@@H](C)O)C(=O)NCC(=O)N1CCC[C@H]1C(=O)N1CCC[C@H]1C(=O)N1CCC[C@H]1C(=O)NCC(=O)N[C@@H](Cc1ccccc1)C(=O)N[C@@H](CO)C(=O)N1CCC[C@H]1C(=O)N[C@@H](Cc1ccccc1)C(=O)N[C@@H](CCCN=C(N)N)C(N)=O