Reaction Details
TargetCannabinoid receptor 1
LigandBDBM22988
Substrate/Competitorn/a
Ki 35.8±n/a nM
CommentsPDSP_301
Citation Stefano, GBSalzet, BSalzet, M Identification and characterization of the leech CNS cannabinoid receptor: coupling to nitric oxide release. Brain Res753:219-24 (1997) 
 
Cannabinoid receptor 1
Name:Cannabinoid receptor 1
Type:Enzyme Catalytic Domain
Mol. Mass.:44900.17
Organism:Hirudo medicinalis
Description:CANNABINOID CB1 CNR1 Hirudo medicinalis::A0A0H4AWC7
Residue:396
BDBM22988
NameBDBM22988
Synonyms:(5Z,8Z,11Z,14Z)-N-(2-hydroxyethyl)icosa-5,8,11,14-tetraenamide ANANDAMIDE Arachidonoyl ethanolamide (AEA) Arachidonylethanolamide [14C]Anandamide | [3H]Anandamide
Typeradiolabeled substrate
Emp. Form.C22H37NO2
Mol. Mass.347.5347
SMILESCCCCC\C=C/C\C=C/C\C=C/C\C=C/CCCC(=O)NCCO