Reaction Details
TargetMetabotropic glutamate receptor 1
LigandBDBM85077
Substrate/Competitorn/a
Ki>10000±n/a nM
CommentsPDSP_2027
Citation Conn, PJPin, JP Pharmacology and functions of metabotropic glutamate receptors. Annu Rev Pharmacol Toxicol37:205-37 (1997) 
 
Metabotropic glutamate receptor 1
Name:Metabotropic glutamate receptor 1
Type:Enzyme
Mol. Mass.:132358.19
Organism:Homo sapiens (Human)
Description:Q13255
Residue:1194
BDBM85077
NameBDBM85077
Synonyms:3-Phosphono-D,L-2-aminopropionic acid, 7 L-AP3 | NSC_3857
TypeSmall organic molecule
Emp. Form.C3H8NO5P
Mol. Mass.169.0731
SMILESNC(CP(O)(O)=O)C(O)=O