Reaction Details
TargetMetabotropic glutamate receptor 5
LigandBDBM82355
Substrate/Competitorn/a
Ki 2000±n/a nM
CommentsPDSP_3205
Citation Conn, PJPin, JP Pharmacology and functions of metabotropic glutamate receptors. Annu Rev Pharmacol Toxicol37:205-37 (1997) 
 
Metabotropic glutamate receptor 5
Name:Metabotropic glutamate receptor 5
Type:Enzyme
Mol. Mass.:132484.72
Organism:Homo sapiens (Human)
Description:n/a
Residue:1212
BDBM82355
NameBDBM82355
Synonyms:Amino-(3-hydroxy-isoxazol-5-yl)-acetic acid(Ibotenic acid) CHEMBL284895 Ibotenic acid | NSC_1233
TypeSmall organic molecule
Emp. Form.C5H6N2O4
Mol. Mass.158.1121
SMILESNC(C(O)=O)c1cc(=O)[nH]o1