Reaction Details
Target5-hydroxytryptamine receptor 7
LigandBDBM50001775
Substrate/Competitorn/a
Ki 50.12±n/a nM
CommentsPDSP_1602
Citation Eglen, RMJasper, JRChang, DJMartin, GR The 5-HT7 receptor: orphan found. Trends Pharmacol Sci18:104-7 (1997) 
 
5-hydroxytryptamine receptor 7
Name:5-hydroxytryptamine receptor 7
Type:Enzyme Catalytic Domain
Mol. Mass.:49632.36
Organism:GUINEA PIG
Description:5-HT7 HTR7 GUINEA PIG::P50407
Residue:446
BDBM50001775
NameBDBM50001775
Synonyms:(ritanserin)6-(2-{4-[Bis-(4-fluoro-phenyl)-methylene]-piperidin-1-yl}-ethyl)-7-methyl-2,3-dihydro-1H-indolizin-5-one 6-(2-(4-(bis(4-fluorophenyl)methylene)piperidin-1-yl)ethyl)-7-methyl-5H-thiazolo[3,2-a]pyrimidin-5-one 6-(2-{4-[Bis-(4-fluoro-phenyl)-methylene]-piperidin-1-yl}-ethyl)-7-methyl-thiazolo[3,2-a]pyrimidin-5-one 6-(2-{4-[Bis-(4-fluoro-phenyl)-methylene]-piperidin-1-yl}-ethyl)-7-methyl-thiazolo[3,2-a]pyrimidin-5-one(Ritanserin) RITANSERIN cid_5074
TypeSmall organic molecule
Emp. Form.C27H25F2N3OS
Mol. Mass.477.569
SMILES[#6]-c1nc2sccn2c(=O)c1-[#6]-[#6]-[#7]-1-[#6]-[#6]\[#6](-[#6]-[#6]-1)=[#6](\c1ccc(F)cc1)-c1ccc(F)cc1