Reaction Details
TargetVasoactive intestinal polypeptide receptor 2
LigandBDBM85078
Substrate/Competitorn/a
Ki 9.6±n/a nM
CommentsPDSP_1607
Citation Xia, MSreedharan, SPBolin, DRGaufo, GOGoetzl, EJ Novel cyclic peptide agonist of high potency and selectivity for the type II vasoactive intestinal peptide receptor. J Pharmacol Exp Ther281:629-33 (1997) Vasoactive intestinal polypeptide receptor 2
Name:Vasoactive intestinal polypeptide receptor 2
Type:Enzyme Catalytic Domain
Mol. Mass.:49488.30
Organism:Homo sapiens (Human)
Description:VIP 2 VIPR2 HUMAN::P41587
Residue:438
BDBM85078
NameBDBM85078
Synonyms:CAS_150828-75-4 | Ro 25-1392
TypeSmall organic molecule
Emp. Form.C65H111N15O13
Mol. Mass.1310.6695
SMILESCCCCCCCCC[C@H](NC(=O)[C@H](CCCCN)NC(=O)[C@@H](NC(=O)[C@@H]1CC(=O)NCCCC[C@H](NC(=O)[C@H](CCCCN)NC(=O)[C@H](C)NC(=O)C(C)C)C(=O)N[C@@H](Cc2ccccc2)C(=O)N[C@@H](C(C)CC)C(=O)NC(CC(N)=O)C(=O)N1)C(C)CC)C(N)=O