Reaction Details
Target5-hydroxytryptamine receptor 1A
LigandBDBM82564
Substrate/Competitorn/a
Ki 1.9±n/a nM
CommentsPDSP_1655
Citation Mos, JVan Hest, AVan Drimmelen, MHerremans, AHOlivier, B The putative 5-HT1A receptor antagonist DU125530 blocks the discriminative stimulus of the 5-HT1A receptor agonist flesinoxan in pigeons. Eur J Pharmacol325:145-53 (1997) 
 
5-hydroxytryptamine receptor 1A
Name:5-hydroxytryptamine receptor 1A
Type:Enzyme Catalytic Domain
Mol. Mass.:45800.53
Organism:pigeon
Description:5-HT1A HTR1A pigeon::A0A1V4KRM0
Residue:413
BDBM82564
NameBDBM82564
Synonyms:CAS_132787 S 15535
TypeSmall organic molecule
Emp. Form.C21H24N2O2
Mol. Mass.336.4275
SMILESC1C(Cc2ccccc12)N1CCN(CC1)c1cccc2OCCOc12