Reaction Details
Target5-hydroxytryptamine receptor 1B
LigandBDBM86708
Substrate/Competitorn/a
Ki 8310±n/a nM
CommentsPDSP_1954
Citation Mos, JVan Hest, AVan Drimmelen, MHerremans, AHOlivier, B The putative 5-HT1A receptor antagonist DU125530 blocks the discriminative stimulus of the 5-HT1A receptor agonist flesinoxan in pigeons. Eur J Pharmacol325:145-53 (1997) 
 
5-hydroxytryptamine receptor 1B
Name:5-hydroxytryptamine receptor 1B
Type:Enzyme Catalytic Domain
Mol. Mass.:42162.70
Organism:pigeon
Description:5-HT1B HTR1B pigeon::A0A1V4JMG2
Residue:379
BDBM86708
NameBDBM86708
Synonyms:CAS_146714-97-8 CHEMBL514874 NSC_104911 | WAY 100,635
TypeSmall organic molecule
Emp. Form.C25H34N4O2
Mol. Mass.422.5631
SMILESCOc1ccccc1N1CCN(CCN(C(=O)C2CCCCC2)c2ccccn2)CC1