Reaction Details
Target5-hydroxytryptamine receptor 1D
LigandBDBM82369
Substrate/Competitorn/a
Ki 1000±n/a nM
CommentsPDSP_1953
Citation Mos, JVan Hest, AVan Drimmelen, MHerremans, AHOlivier, B The putative 5-HT1A receptor antagonist DU125530 blocks the discriminative stimulus of the 5-HT1A receptor agonist flesinoxan in pigeons. Eur J Pharmacol325:145-53 (1997) 
 
5-hydroxytryptamine receptor 1D
Name:5-hydroxytryptamine receptor 1D
Type:Enzyme Catalytic Domain
Mol. Mass.:41807.41
Organism:pigeon
Description:5-HT1D HTR1D pigeon::A0A1V4JDN9
Residue:375
BDBM82369
NameBDBM82369
Synonyms:CAS_133025-23-7 WAY 100135
TypeSmall organic molecule
Emp. Form.C24H33N3O2
Mol. Mass.395.5377
SMILESCOc1ccccc1N1CCN(C[C@@H](C(=O)NC(C)(C)C)c2ccccc2)CC1