Reaction Details
Target5-hydroxytryptamine receptor 3A
LigandBDBM86708
Substrate/Competitorn/a
Ki>10000±n/a nM
CommentsPDSP_1954
Citation Mos, JVan Hest, AVan Drimmelen, MHerremans, AHOlivier, B The putative 5-HT1A receptor antagonist DU125530 blocks the discriminative stimulus of the 5-HT1A receptor agonist flesinoxan in pigeons. Eur J Pharmacol325:145-53 (1997) 
 
5-hydroxytryptamine receptor 3A
Name:5-hydroxytryptamine receptor 3A
Type:Enzyme Catalytic Domain
Mol. Mass.:46633.35
Organism:pigeon
Description:5-HT3 HTR3A pigeon::A0A218UVI3
Residue:407
BDBM86708
NameBDBM86708
Synonyms:CAS_146714-97-8 CHEMBL514874 NSC_104911 | WAY 100,635
TypeSmall organic molecule
Emp. Form.C25H34N4O2
Mol. Mass.422.5631
SMILESCOc1ccccc1N1CCN(CCN(C(=O)C2CCCCC2)c2ccccn2)CC1