Reaction Details
TargetAlpha-1A adrenergic receptor
LigandBDBM82564
Substrate/Competitorn/a
Ki 144±n/a nM
CommentsPDSP_1655
Citation Mos, JVan Hest, AVan Drimmelen, MHerremans, AHOlivier, B The putative 5-HT1A receptor antagonist DU125530 blocks the discriminative stimulus of the 5-HT1A receptor agonist flesinoxan in pigeons. Eur J Pharmacol325:145-53 (1997) 
 
Alpha-1A adrenergic receptor
Name:Alpha-1A adrenergic receptor
Synonyms:adrenergic Alpha1
Type:Enzyme Catalytic Domain
Mol. Mass.:50699.64
Organism:pigeon
Description:adrenergic Alpha1 0 pigeon::A0A1V4KJJ8
Residue:464
BDBM82564
NameBDBM82564
TypeSmall organic molecule
Emp. Form.C21H24N2O2
Mol. Mass.336.4275
SMILESC1C(Cc2ccccc12)N1CCN(CC1)c1cccc2OCCOc12