Reaction Details
TargetNeuromedin-K receptor
LigandBDBM81944
Substrate/Competitorn/a
Ki 0.81±n/a nM
CommentsPDSP_1334
Citation Sarau, HMGriswold, DEPotts, WFoley, JJSchmidt, DBWebb, EFMartin, LDBrawner, MEElshourbagy, NAMedhurst, ADGiardina, GAHay, DW Nonpeptide tachykinin receptor antagonists: I. Pharmacological and pharmacokinetic characterization of SB 223412, a novel, potent and selective neurokinin-3 receptor antagonist. J Pharmacol Exp Ther281:1303-11 (1997) Neuromedin-K receptor
Name:Neuromedin-K receptor
Type:Enzyme
Mol. Mass.:52221.96
Organism:Homo sapiens (Human)
Description:P29371
Residue:465
BDBM81944
NameBDBM81944
Synonyms:CAS_86933-75-7 NSC_5311312 | neuromedin K
TypeSmall organic molecule
Emp. Form.C55H79N13O14S2
Mol. Mass.1210.424
SMILESCSCCC(NC(=O)C(CC(C)C)NC(=O)CNC(=O)C(NC(=O)C(Cc1ccccc1)NC(=O)C(Cc1ccccc1)NC(=O)C(CC(O)=O)NC(=O)C(Cc1cnc[nH]1)NC(=O)C(CCSC)NC(=O)C(N)CC(O)=O)C(C)C)C(N)=O