Reaction Details
TargetD(4) dopamine receptor
LigandBDBM21398
Substrate/Competitorn/a
Ki 15±n/a nM
CommentsPDSP_918
Citation Newman-Tancredi, AAudinot, VChaput, CVerrièle, LMillan, MJ [35S]Guanosine-5'-O-(3-thio)triphosphate binding as a measure of efficacy at human recombinant dopamine D4.4 receptors: actions of antiparkinsonian and antipsychotic agents. J Pharmacol Exp Ther282:181-91 (1997) D(4) dopamine receptor
Name:D(4) dopamine receptor
Type:Enzyme
Mol. Mass.:48373.19
Organism:Homo sapiens (Human)
Description:P21917
Residue:419
BDBM21398
NameBDBM21398
Synonyms:4-[4-(4-Chloro-phenyl)-4-hydroxy-piperidin-1-yl]-1-(4-fluoro-phenyl)-butan-1-one;propionate(HCl) CHEMBL54 Haloperidol | Haloperidol, 1
TypeSmall organic molecule
Emp. Form.C21H23ClFNO2
Mol. Mass.375.864
SMILESOC1(CCN(CCCC(=O)c2ccc(F)cc2)CC1)c1ccc(Cl)cc1