Reaction Details
TargetSodium-dependent dopamine transporter
LigandBDBM22167
Substrate/Competitorn/a
Ki 1.6±n/a nM
CommentsPDSP_871
Citation Garreau, LEmond, PBelzung, CGuilloteau, DFrangin, YBesnard, JCChalon, S N-(3-lodoprop-2E-enyl)-2beta-carbomethoxy-3beta-(3',4'-dichloro phenyl)nortropane (beta-CDIT), a tropane derivative: pharmacological characterization as a specific ligand for the dopamine transporter in the rodent brain. J Pharmacol Exp Ther282:467-74 (1997) Sodium-dependent dopamine transporter
Name:Sodium-dependent dopamine transporter
Type:Multi-pass membrane protein
Mol. Mass.:68749.45
Organism:Rattus norvegicus (rat)
Description:P23977
Residue:619
BDBM22167
NameBDBM22167
Synonyms:1-[2-(diphenylmethoxy)ethyl]-4-(3-phenylpropyl)piperazine CHEMBL434080 GBR-12935
TypeSmall organic molecule
Emp. Form.C28H34N2O
Mol. Mass.414.5824
SMILESC(CN1CCN(CCOC(c2ccccc2)c2ccccc2)CC1)Cc1ccccc1