Reaction Details
Target5-hydroxytryptamine receptor 2A
LigandBDBM22867
Substrate/Competitorn/a
Ki 0.74±n/a nM
CommentsPDSP_1079
Citation Bonhaus, DWWeinhardt, KKTaylor, MDeSouza, AMcNeeley, PMSzczepanski, KFontana, DJTrinh, JRocha, CLDawson, MWFlippin, LAEglen, RM RS-102221: a novel high affinity and selective, 5-HT2C receptor antagonist. Neuropharmacology36:621-9 (1997) 
 
5-hydroxytryptamine receptor 2A
Name:5-hydroxytryptamine receptor 2A
Type:undefined
Mol. Mass.:52607.65
Organism:Homo sapiens (Human)
Description:P28223
Residue:471
BDBM22867
NameBDBM22867
Synonyms:1,1-diethyl-3-[(8beta)-6-methyl-9,10-didehydroergolin-8-yl]urea 8R-lisuride | LISURIDE
TypeSmall organic molecule
Emp. Form.C20H26N4O
Mol. Mass.338.4466
SMILES[H][C@@]12Cc3c[nH]c4cccc(C1=C[C@H](CN2C)NC(=O)N(CC)CC)c34