Reaction Details
Target5-hydroxytryptamine receptor 2C
LigandBDBM50005835
Substrate/Competitorn/a
Ki>10000±n/a nM
CommentsPDSP_1788
Citation Bonhaus, DWWeinhardt, KKTaylor, MDeSouza, AMcNeeley, PMSzczepanski, KFontana, DJTrinh, JRocha, CLDawson, MWFlippin, LAEglen, RM RS-102221: a novel high affinity and selective, 5-HT2C receptor antagonist. Neuropharmacology36:621-9 (1997) 
 
5-hydroxytryptamine receptor 2C
Name:5-hydroxytryptamine receptor 2C
Type:G Protein-Coupled Receptor (GPCR)
Mol. Mass.:51836.79
Organism:Homo sapiens (Human)
Description:P28335
Residue:458
BDBM50005835
NameBDBM50005835
Synonyms:(3-[2-(dimethylamino)ethyl]-1H-indol-5-yl)-N-methylmethanesulfonamide 1-{3-[2-(dimethylamino)ethyl]-1H-indol-5-yl}-N-methylmethanesulfonamide 3-[2-(dimethylamino)ethyl]-N-methylindole-5-methanesulfonamide SUMATRIPTAN Sumax
TypeSmall organic molecule
Emp. Form.C14H21N3O2S
Mol. Mass.295.4
SMILESCNS(=O)(=O)Cc1ccc2[nH]cc(CCN(C)C)c2c1