Reaction Details
TargetDipeptidyl peptidase 1
LigandBDBM201023
Substrate/Competitorn/a
Meas. Tech.Inhibition of Human DPPI
Temperature298.15±n/a K
IC50 0.500±n/a nM
Commentsextracted
Citation Vintonyak, VGrauert, MGrundl, MPautsch, A Substituted spirocycles US Patent US9879026 Publication Date 1/30/2018
 
Dipeptidyl peptidase 1
Name:Dipeptidyl peptidase 1
Type:Enzyme
Mol. Mass.:51857.28
Organism:Homo sapiens (Human)
Description:P53634
Residue:463
BDBM201023
NameBDBM201023
Synonyms:US9540373, 12 USRE47636, Example 12
TypeSmall organic molecule
Emp. Form.C27H27FN4O3
Mol. Mass.474.5267
SMILESCN1CC2(C1)OC(=O)c1ccc(cc21)-c1ccc(C[C@H](NC(=O)[C@H]2N[C@@H]3CC[C@H]2C3)C#N)c(F)c1