Reaction Details
TargetPeptidyl-prolyl cis-trans isomerase A
LigandBDBM85117
Substrate/Competitorn/a
Meas. Tech.PPIase Assay
Ki>1.00e+5±n/a nM
Citation Dunsmore, CJMalone, KJBailey, KRWear, MAFlorance, HShirran, SBarran, PEPage, APWalkinshaw, MDTurner, NJ Design and synthesis of conformationally constrained cyclophilin inhibitors showing a cyclosporin-A phenotype in C. elegans. Chembiochem12:802-10 (2011) 
 
Peptidyl-prolyl cis-trans isomerase A
Name:Peptidyl-prolyl cis-trans isomerase A
Type:Protein
Mol. Mass.:18015.32
Organism:Homo sapiens (Human)
Description:P62937
Residue:165
BDBM85117
NameBDBM85117
Synonyms:Cyclophilin Inhibitor, 3c
TypeSmall organic molecule
Emp. Form.C18H26N4O6
Mol. Mass.394.4222
SMILESCOC(=O)[C@H](CCCN=C(N)NN(=O)=O)C1C(=O)CC2C1=CC(=O)CC2(C)C