Reaction Details
TargetPeptidyl-prolyl cis-trans isomerase A
LigandBDBM85119
Substrate/Competitorn/a
Meas. Tech.PPIase Assay
Ki 2.070e+5± 5.78e+4 nM
Citation Dunsmore, CJMalone, KJBailey, KRWear, MAFlorance, HShirran, SBarran, PEPage, APWalkinshaw, MDTurner, NJ Design and synthesis of conformationally constrained cyclophilin inhibitors showing a cyclosporin-A phenotype in C. elegans. Chembiochem12:802-10 (2011) 
 
Peptidyl-prolyl cis-trans isomerase A
Name:Peptidyl-prolyl cis-trans isomerase A
Type:Protein
Mol. Mass.:18015.32
Organism:Homo sapiens (Human)
Description:P62937
Residue:165
BDBM85119
NameBDBM85119
Synonyms:Cyclophilin Inhibitor, 3e
TypeSmall organic molecule
Emp. Form.C30H38N2O6S
Mol. Mass.554.698
SMILESCOC(=O)[C@H](CCCCNS(=O)(=O)c1cccc2c(cccc12)N(C)C)C1C(=O)CC2C1=CC(=O)CC2(C)C