Reaction Details
TargetPeptidyl-prolyl cis-trans isomerase A
LigandBDBM85116
Substrate/Competitorn/a
Meas. Tech.PPIase Assay
Ki>1.00e+5±n/a nM
Citation Dunsmore, CJMalone, KJBailey, KRWear, MAFlorance, HShirran, SBarran, PEPage, APWalkinshaw, MDTurner, NJ Design and synthesis of conformationally constrained cyclophilin inhibitors showing a cyclosporin-A phenotype in C. elegans. Chembiochem12:802-10 (2011) 
 
Peptidyl-prolyl cis-trans isomerase A
Name:Peptidyl-prolyl cis-trans isomerase A
Type:Protein
Mol. Mass.:18015.32
Organism:Homo sapiens (Human)
Description:P62937
Residue:165
BDBM85116
NameBDBM85116
Synonyms:Cyclophilin Inhibitor, 15 | Cyclophilin Inhibitor, 3b
TypeSmall organic molecule
Emp. Form.C18H27NO4
Mol. Mass.321.4113
SMILESCOC(=O)[C@H](CCCCN)C1C(=O)CC2C1=CC(=O)CC2(C)C