Reaction Details
TargetHomoserine kinase
LigandBDBM85124
Substrate/Competitorn/a
Meas. Tech.Enzyme Inhibition Assay
pH7.5±0
Temperature310.15±0 K
Ki 4.6e+2± 4e+1 nM
Citation De Pascale, GGriffiths, EJShakya, TNazi, IWright, GD Identification and characterization of new inhibitors of fungal homoserine kinase. Chembiochem12:1179-82 (2011) 
 
Homoserine kinase
Name:Homoserine kinase
Type:Enzyme
Mol. Mass.:33619.26
Organism:Escherichia coli
Description:P00547
Residue:310
BDBM85124
NameBDBM85124
Synonyms:Thr1 inhibitor, 4
TypeSmall organic molecule
Emp. Form.C19H14O6
Mol. Mass.338.3109
SMILESOc1c(CC2C(=O)OC3C=CCC=C3C2=O)c(=O)oc2ccccc12