Reaction Details
Target5-hydroxytryptamine receptor 6
LigandBDBM50130280
Substrate/Competitorn/a
Ki>10000±n/a nM
CommentsPDSP_166
Citation Boess, FGMonsma, FJCarolo, CMeyer, VRudler, AZwingelstein, CSleight, AJ Functional and radioligand binding characterization of rat 5-HT6 receptors stably expressed in HEK293 cells. Neuropharmacology36:713-20 (1997) 
 
5-hydroxytryptamine receptor 6
Name:5-hydroxytryptamine receptor 6
Type:Enzyme Catalytic Domain
Mol. Mass.:46945.51
Organism:RAT
Description:5-HT6 HTR6 RAT::P31388
Residue:436
BDBM50130280
NameBDBM50130280
Synonyms:5-HTQ CHEMBL317971
TypeSmall organic molecule
Emp. Form.C13H19N2O
Mol. Mass.219.3022
SMILESC[N+](C)(C)CCc1c[nH]c2ccc(O)cc12