Reaction Details
TargetGamma-aminobutyric acid type B receptor subunit 1
LigandBDBM24184
Substrate/Competitorn/a
Ki 5±n/a nM
CommentsPDSP_3487
Citation Chebib, MVandenberg, RJFroestl, WJohnston, GA Unsaturated phosphinic analogues of gamma-aminobutyric acid as GABA(C) receptor antagonists. Eur J Pharmacol329:223-9 (1997) Gamma-aminobutyric acid type B receptor subunit 1
Name:Gamma-aminobutyric acid type B receptor subunit 1
Type:Enzyme Catalytic Domain
Mol. Mass.:111548.69
Organism:Rattus norvegicus (Rat)
Description:Q9Z0U4
Residue:991
BDBM24184
NameBDBM24184
Synonyms:(3-aminopropyl)phosphinic acid CGP27492 | CHEMBL112203
TypeSmall organic molecule
Emp. Form.C3H10NO2P
Mol. Mass.123.0908
SMILESNCCCP(O)=O